ARTICLE DETAIL

资讯详情

深耕网站建设、视觉设计与SEO优化的一线实战洞察。

AXI3协议本质:五通道流水线与ID驱动的事务契约

AXI3协议本质:五通道流水线与ID驱动的事务契约

简介:本资源是一份面向数字电路设计工程师、SoC验证工程师及高校微电子/集成电路专业学习者的AMBA AXI3总线协议深度解析资料,聚焦高性能嵌入式系统中关键互连标准的原理与实现。内容系统覆盖AXI3核心架构、五大独立通道(读地址/读数据/写地址/写数据/写响应)定义、VALID/READY握手机制、outstanding与乱序传输机制、字节选通非对齐访问、突发传输模式等关键技术点,并结合时序收敛、低功耗扩展等工程实践要点展开说明。资源为1个1.5MB的PDF文档,结构完整,含图示通道时序、信号定义表及规范原文精要,便于快速查阅与原理理解。目前已有530人学习下载,适合初入AMBA生态的工程师建立体系化认知,也适合作为FPGA接口开发、IP集成与总线验证环节的权威参考手册。

1. AXI3 协议不是“更快的 AHB”,而是用五条独立流水线重构了总线通信的底层契约

你写完一个 AXI 主机 RTL 模块,仿真波形里 VALID/READY 握手全对齐、地址和数据严丝合缝、ID tag 顺序也守规矩——但一上板就卡死,或者在多从机压力下出现读响应错乱、写响应丢失。这不是时序没收敛,也不是综合工具抽风。这是你把 AXI3 当成了“带宽更大的 AHB”来用,而它根本不是总线协议的升级版,它是一套重新定义主从关系、解耦时序依赖、将通信建模为状态机网络的系统级契约。

AXI3 的核心反直觉点在于:它不保证“地址发完就一定马上来数据”,也不要求“写完最后一个字节才给响应”。它允许写地址通道比写数据通道快 3 个周期,允许读数据在读地址发出后第 7 个周期才开始返回,甚至允许 ID=2 的读请求比 ID=1 的先完成——只要同 ID 内部顺序不变。这种“松耦合+强标识”的设计,不是为了炫技,而是为了解决亚微米工艺下长互连路径带来的时序地狱:当 CPU 核心频率冲到 2GHz,而 DDR 控制器延迟动辄上百 ns,硬性同步只会让整个 SoC 频率被最慢模块拖垮。AXI3 把“谁等谁”这个隐含逻辑,显式拆成五组独立 VALID/READY 握手(AW/AR/W/R/B),再用 ID 字段做事务血缘绑定,本质上是把总线从“共享时钟域的同步总线”升维成“事件驱动的异步消息总线”。你看到的“分离通道”,背后是芯片架构师在物理限制与性能目标之间划出的一条生存线——而这条线,正是所有 AXI3 集成翻车、验证漏项、时序反复迭代的根源。搞懂它,不是为了背信号表,而是为了在第一次画 interconnect 拓扑、第一次写 burst length 计算逻辑、第一次调试 out-of-order 响应错位时,能一眼看穿问题落在哪一层契约断裂上。


2. 五通道握手:VALID/READY 不是握手协议,而是五条独立的、可插寄存器片的微流水线

AXI3 的“五通道”(AW/AR/W/R/B)常被简化为“读写分离”,但这种说法掩盖了其真正的工程价值:每个通道都是一个可独立调度、可单独插入寄存器片、且握手机制完全自治的微流水线。它不像 AHB 那样靠 HREADY 一根线全局阻塞,而是让地址、写数据、读数据、响应各自按自己的节奏推进。理解这一点,才能真正驾驭 AXI3 的高频潜力。

2.1 每条通道的 VALID/READY 是独立状态机,而非同步信号

以写地址通道(AW)为例,主机驱动AWADDR和AWVALID=1,此时从机可以:

  • 立即拉高AWREADY=1(单周期接收);
  • 或者等待 2 个周期后再拉高(如内部仲裁未完成);
  • 甚至在AWVALID=0时就提前拉高AWREADY=1(预取准备)。

关键约束只有一条:AWVALID必须保持为 1,直到AWREADY变为 1 的那个时钟沿采样生效。这意味着AWVALID的撤销时机,完全由从机AWREADY的上升沿决定,而不是由主机主观控制。同理,读数据通道(R)中,从机必须在RVALID=1后持续维持该值,直到RREADY=1被采样;而主机RREADY可以在任意时刻拉高,哪怕RVALID=0(表示“我随时能接,但你还没发”)。

这种设计直接导致一个硬件事实:AWVALID和AWREADY之间的组合逻辑路径,是整个 AXI 接口时序收敛的瓶颈点。若从机在AWREADY上做了复杂仲裁(比如查路由表+检查 QoS),就必须在AWVALID到AWREADY的路径上插入寄存器片(register slice),否则无法满足 setup/hold。而 AXI3 明确允许在任意通道任意位置插入寄存器片,正是因为它的协议层已将“握手延迟”视为一等公民,而非需要规避的缺陷。

// 典型的 AW 通道寄存器片实现(简化) always @(posedge ACLK or negedge ARESETn) begin if (!ARESETn) begin awaddr_r <= '0; awid_r <= '0; awlen_r <= '0; awsize_r <= '0; awburst_r<= '0; awvalid_r<= 1'b0; end else if (awvalid_int && awready_r) begin // 注意:这里用内部寄存后的 valid awaddr_r <= awaddr_int; awid_r <= awid_int; awlen_r <= awlen_int; awsize_r <= awsize_int; awburst_r<= awburst_int; awvalid_r<= 1'b1; end else if (awready_r) begin awvalid_r <= 1'b0; // 清除 valid,等待下一次 end end assign AWREADY = awready_r; // 输出给主机的 ready,来自寄存器输出

提示:这段代码里awvalid_r的置位条件是awvalid_int && awready_r,而非awvalid_int。这体现了 AXI3 的核心机制:VALID 的传播必须严格跟随 READY 的反馈。如果错误地写成awvalid_r <= awvalid_int,就会导致从机在未准备好时就向后级传递地址,引发下游 FIFO 溢出或地址错乱。

2.2 通道间无默认时序关系,重排序自由度由 ID 字段精确管控

AXI3 明确声明:“读数据必须始终紧跟在对应的地址之后”、“写响应必须始终紧跟在写事物中和该响应相关的上一个写传输之后”。注意,这里“紧跟”不是指“下一个周期”,而是指语义上的因果绑定。例如:

  • 主机发出ARID=1, ARADDR=0x1000, ARLEN=3(4-beat 读);
  • 从机可以在ARREADY采样后第 5 个周期才开始返回RID=1, RDATA=...;
  • 但一旦开始返回,RLAST必须在第 4 个RVALID=1周期拉高,且RID必须恒为 1。

而不同 ID 的事务则完全解耦:

  • ARID=1的读可能在ARID=2的读之后完成;
  • AWID=3的写地址可能比AWID=1的写数据更早到达 interconnect;
  • BID=1的写响应甚至可能在WID=2的写数据全部送达前就返回。

这种自由度不是放任不管,而是通过 ID 字段实现事务粒度的状态隔离。interconnect 在路由时,对每个 ID 维护独立的 request queue 和 response queue;从机在生成响应时,必须将BID设为对应AWID,将RID设为对应ARID。ID 就像 TCP 的 sequence number,它不保证全局顺序,但保证每个流内部的顺序与完整性。

2.3 寄存器片(Register Slice)不是“加缓冲”,而是协议层授权的时序切割点

AXI3 文档反复强调:“每个通道只在一个方向上传送信息,并且在各种通道之间不要求有固定的关系。这点很重要,因为这可以在任何通道中插入一个寄存器片。” 这句话的潜台词是:AXI3 协议本身已将跨时钟域、长布线延迟、多级仲裁等现实约束,内化为协议的合法操作空间。

一个典型场景:CPU core 工作在 2GHz,DDR PHY 工作在 800MHz,中间 interconnect 需要跨时钟域桥接。若强行让 AW 通道在 2GHz 下直达 DDR 控制器,AWVALID到AWREADY的路径必然超时。此时标准做法不是降频,而是:

  • 在 CPU 侧插入一级 register slice,将AWVALID/AWREADY握手降频到 1GHz;
  • 再在 interconnect 侧插入二级 slice,对接 DDR PHY 的 800MHz;
  • 每一级 slice 都只缓存当前 beat 的地址/控制字段,并严格遵循 VALID/READY 传递规则。

这种分层切片之所以可行,正是因为 AXI3 的五通道设计天然支持“断点续传”:AW 通道切片不影响 W 通道的独立推进,R 通道的延迟也不影响 B 通道的响应生成。它把传统总线中“全局同步”的刚性要求,转化成了“每通道自治 + ID 关联”的柔性模型。


3. 突发(Burst)不是“连续地址搬运”,而是由 SIZE/LEN/BURST 三元组定义的地址生成算法

AXI3 的“突发传输”常被误解为“主机发一个起始地址,从机自动搬 N 个连续字节”。这是危险的简化。实际上,突发是一套由SIZE(每拍字节数)、LEN(拍数减一)、BURST(地址模式)共同参与的、在从机端实时计算的地址生成引擎。主机只提供种子,从机才是真正的地址计算器。搞错这三者的组合逻辑,轻则数据错位,重则地址越界访问非法空间。

3.1 SIZE 决定单拍宽度,LEN 决定拍数,BURST 决定地址步进方式

AWSIZE/ARSIZE(3-bit)编码的是单次数据传输(beat)所覆盖的字节数,而非数据总线宽度。例如:

  • AWSIZE=3'b011→ 8 bytes/beat;
  • AWLEN=4'b0011→ LEN=3 → 总共 4 beats;
  • 若数据总线为 64-bit(8 bytes),则此突发恰好填满总线,无需字节选通;
  • 但若数据总线为 256-bit(32 bytes),则每 beat 只使用其中 8 bytes,WSTRB 会指示具体哪 8 bytes 有效。

AWLEN/ARLEN(4-bit)表示的是LEN = [3:0] 的整数值,实际传输拍数为 LEN+1。因此b1111对应 16 beats,而非 15。这个“+1”设计是为了让编码b0000表示最常用的 single transfer(1 beat),避免用b1111表示 15 这种反直觉映射。

AWBURST/ARBURST(2-bit)则定义地址如何递进:

  • 2'b00(FIXED):所有 beat 地址相同 → 用于 FIFO push/pop;
  • 2'b01(INCR):地址按SIZE步进 →0x1000 → 0x1008 → 0x1010(SIZE=8);
  • 2'b10(WRAP):地址按SIZE*LEN+1回环 →0x1000 → 0x1008 → 0x1010 → 0x1000(LEN=3, SIZE=8, wrap boundary=0x1000)。

注意:WRAP 模式有两个硬性约束:① 起始地址必须ADDR % (SIZE * (LEN+1)) == 0;②LEN+1必须是 2/4/8/16。违反任一条件,行为未定义(通常触发 SLVERR)。

3.2 地址计算在从机端完成,主机仅提供起始地址和控制信号

AXI3 协议明确要求:“主机只提供突发的第一个地址,和地址一起被发送的控制信号决定了突发中剩余传输的地址是怎么计算的。” 这意味着:

  • 主机发送AWADDR=0x1004, AWSIZE=3'b010 (4 bytes), AWLEN=4'b0001 (2 beats), AWBURST=2'b01 (INCR);
  • 从机收到后,自行计算:
    • Beat 0 地址 =0x1004
    • Beat 1 地址 =0x1004 + 4 = 0x1008
  • 主机绝不能假设从机会把0x1004对齐到 4-byte 边界再计算;它必须确保0x1004本身符合SIZE=4的对齐要求(即0x1004 % 4 == 0),否则从机可能拒绝或产生不可预测行为。

这个机制带来一个关键推论:非对齐突发的合法性,完全取决于 SIZE 和起始地址的数学关系,而非主机的“意图”。例如:

  • AWADDR=0x1003, AWSIZE=3'b000 (1 byte)→ 合法(1-byte 访问无对齐要求);
  • AWADDR=0x1003, AWSIZE=3'b001 (2 bytes)→ 非法(2-byte 访问要求地址 %2==0);
  • AWADDR=0x1003, AWSIZE=3'b010 (4 bytes)→ 非法(4-byte 访问要求地址 %4==0)。

3.3 WRAP 模式的回环边界计算是硬件验证重点

WRAP 模式常用于 cache line fill,其地址回环逻辑极易出错。标准计算公式为:

Wrap_Boundary = (Start_Address / (Number_Bytes * Burst_Length)) * (Number_Bytes * Burst_Length) Address_N = Wrap_Boundary + ((N-1) * Number_Bytes) // 若未超界 Address_N = Wrap_Boundary // 若超界(回卷)

以Start_Address=0x1008, SIZE=3'b011 (8 bytes), LEN=3 (4 beats)为例:

  • Number_Bytes = 8,Burst_Length = 4
  • Wrap_Boundary = (0x1008 / (8*4)) * (8*4) = (0x1008 / 32) * 32 = 0x1000
  • Beat 0:0x1000 + 0 = 0x1000
  • Beat 1:0x1000 + 8 = 0x1008
  • Beat 2:0x1000 + 16 = 0x1010
  • Beat 3:0x1000 + 24 = 0x1018

但若Start_Address=0x100A(未对齐),则0x100A / 32 = 0x80(整除),Wrap_Boundary = 0x80 * 32 = 0x1000,此时 Beat 0 地址为0x1000,而非主机发送的0x100A—— 这就是非对齐访问被硬件自动纠正的底层机制。验证时必须用 formal 方法穷举所有(ADDR, SIZE, LEN)组合,确保回环逻辑不溢出、不跳变。


4. ID 字段:不是事务编号,而是跨通道、跨时钟域、跨电源域的状态锚点

在 AXI3 中,ID字段(通常 4~12 bit)常被初学者当作“事务序列号”使用,认为它只是用来区分不同请求。这是对 AXI3 最危险的误读之一。ID 是 AXI3 协议中唯一贯穿全部五通道、承载事务血缘、支撑乱序执行、并作为跨域同步锚点的核心标识符。它决定了响应如何匹配请求、决定了 interconnect 如何调度、决定了低功耗状态机如何挂起/恢复。

4.1 ID 是读写通道的唯一绑定纽带,缺失或错配将导致响应丢失

AXI3 协议强制规定:

  • 写事务中:WID必须等于AWID;BID必须等于AWID;
  • 读事务中:RID必须等于ARID。

这意味着:主机必须在 AW 通道发AWID=5,在 W 通道发WID=5,才能确保从机返回的BID=5被主机正确识别为本次写操作的完成。如果主机错误地在 W 通道发WID=0,即使AWID=5,从机仍会返回BID=5,而主机因等待BID=0永远收不到响应,最终 timeout。

更隐蔽的问题出现在 interconnect 层。当多个主机(M0, M1)连接到同一 interconnect,而 interconnect 又连接多个从机(S0, S1)时,interconnect 必须:

  • 将 M0 的AWID=3重映射为全局唯一GID=0x103(高位 0x1 表示 M0);
  • 将 M1 的AWID=3重映射为GID=0x203(高位 0x2 表示 M1);
  • 在返回响应时,将GID解析回原始AWID和主机 ID。

若 interconnect 实现错误(如未扩展 ID 位宽、或重映射逻辑有 bug),就会出现BID与主机期望AWID不匹配,导致响应被丢弃或误配给其他主机。

4.2 ID 是乱序(Out-of-Order)执行的唯一仲裁依据

AXI3 允许ARID=2的读请求比ARID=1先完成,但严禁ARID=1的第 2 个 beat 比第 1 个 beat 晚返回。这里的“事务”粒度,完全由 ID 定义。一个典型的乱序优化场景:

  • 主机发出ARID=1, ARADDR=0x2000(访问慢速 Flash);
  • 同时发出ARID=2, ARADDR=0x3000(访问高速 SRAM);
  • SRAM 从机在 2 个周期后返回RID=2, RDATA=...;
  • Flash 从机在 20 个周期后才返回RID=1, RDATA=...;
  • 主机根据RID将响应分发给对应软件线程,无需等待ID=1完成。

但如果主机错误地对两个请求使用ARID=1,则 SRAM 的响应会覆盖 Flash 的响应缓冲区,或导致RLAST信号错乱,造成数据截断。ID 就是乱序世界的“宪法”,它不保证顺序,但保证每个 ID 内部的宪法秩序。

4.3 ID 是低功耗状态机(CSYSREQ/CSYSACK)的上下文载体

AXI3 的低功耗扩展(表 2-7)中,CSYSREQ和CSYSACK信号虽不携带 ID,但其生效范围由当前活跃的 ID 事务决定。例如:

  • 主机发出ARID=7, ARADDR=0x4000(访问待机外设);
  • 外设检测到ARID=7是首个访问请求,启动CSYSACK流程;
  • 在CSYSACK确认期间,ARID=7的后续 beat 必须被缓存或重试;
  • 若此时主机又发ARID=8,interconnect 必须将其路由到另一条唤醒路径,而非阻塞在ID=7的低功耗队列中。

ID 在此处成为功耗状态机的“上下文句柄”,它让协议能在不增加额外信号的前提下,支持 per-transaction 的精细功耗管理。


5. 常见问题排查:那些让你在深夜抓狂的 AXI3 验证陷阱

AXI3 协议看似清晰,但其松耦合、多通道、ID 驱动的特性,使得错误表现往往滞后、隐蔽且难以复现。以下是我在多个 SoC 项目中踩过的血泪坑,按“现象→原因→解决”结构整理,每一条都对应真实 tape-out 前的紧急修复。

5.1 现象:读数据RLAST在第 3 个 beat 拉高,但ARLEN=3(应为 4 beats)

原因:ARLEN编码为LEN,实际 beat 数 =LEN+1。ARLEN=3'b0011对应LEN=3,即 4 beats。但 RTL 中误将ARLEN直接当作 beat 数使用,计数器在ARLEN值处停止,导致第 4 beat 被丢弃,RLAST提前拉高。

解决:在从机端实现 beat 计数器时,必须用len_cnt <= ARLEN + 1作为总拍数,而非len_cnt <= ARLEN。验证时需用 assertion 检查RLAST出现的 beat 序号是否等于ARLEN+1。

5.2 现象:AWVALID和WVALID时序完美,但BVALID永远不出现

原因:从机在生成写响应时,错误地将BID设为内部计数器值,而非复制AWID。例如,从机用bid_cnt++生成BID,导致BID与AWID不匹配,主机忽略所有响应。

解决:强制要求BID信号必须直接赋值为awid_reg(AW 通道锁存的 ID),禁止任何运算或计数。添加 formal property:assert property (@(posedge ACLK) (BVALID && BREADY) |-> (BID == awid_reg));

5.3 现象:多主机系统中,主机 A 的写操作偶尔被主机 B 的读响应覆盖

原因:interconnect 未对 ID 进行全局唯一重映射。主机 A 和主机 B 均使用AWID=0,interconnect 直接透传,导致从机返回的BID=0被两个主机同时捕获,响应缓冲区冲突。

解决:interconnect 必须实现 ID 扩展逻辑。例如,用 2-bit 主机 ID 拼接 4-bit 原始 ID,构成 6-bit 全局 GID。并在响应返回时,用高位 2-bit 选择对应主机的响应 FIFO。

5.4 现象:WSTRB在WVALID=0时随机翻转,导致综合工具报 combinational loop

原因:WSTRB信号在WVALID=0时未保持稳定。AXI3 规范虽允许WSTRB在WVALID=0时为任意值,但实际综合中,若WSTRB逻辑依赖于WVALID的下降沿或内部状态,易形成 latch 或环路。

解决:在 RTL 中显式保持WSTRB稳定。例如:assign WSTRB = (WVALID) ? wstrb_calc : wstrb_reg;,并在WVALID变高时更新wstrb_reg。避免任何WSTRB反馈到自身生成逻辑的路径。

5.5 现象:AWREADY在AWVALID=1后第 1 个周期拉高,但波形显示AWADDR在AWREADY采样时未稳定

原因:AWADDR信号路径存在组合逻辑毛刺或未约束的异步输入。AWREADY的采样沿(posedge ACLK)要求AWADDR在 setup/hold 时间内稳定,但若AWADDR来自跨时钟域 FIFO 或未加 pipeline 的计算逻辑,setup time 无法满足。

解决:对AWADDR路径进行静态时序分析(STA),在关键路径插入寄存器片。若来自跨时钟域,必须使用双触发器同步器,并确保同步后至少一个周期再驱动AWVALID。


6. 设计取舍:为什么 AXI3 拒绝“简单”,以及我每次写 interconnect 都强制做的三件事

AXI3 的复杂性不是设计者的傲慢,而是对物理世界妥协后的最优解。它拒绝“简单”,是因为在 2GHz CPU、100+ IP 核、多电压域、跨工艺节点的 SoC 里,“简单”意味着性能归零或流片失败。我曾参与一个图像处理 SoC,最初团队坚持用 AHB 搭建 vision subsystem,结果 DDR 带宽利用率卡在 35%,功耗超标 40%;切换到 AXI3 并启用 full outstanding + out-of-order 后,带宽飙升至 92%,功耗反降 15%。代价是验证周期延长了 3 倍,但 tape-out 成功率从 60% 提升到 100%。这让我深刻意识到:AXI3 的每一个“反直觉”设计,都是用验证成本换来的硅片可靠性。

6.1 为什么坚持用五通道而非四通道?——B 通道的不可替代性

有人提议合并写响应(B)到写数据(W)通道,节省信号线。这是灾难性想法。B 通道的独立存在,本质是将“事务完成确认”与“数据交付”解耦。写数据通道(W)可以被深度流水、被缓存、被重排;而写响应(B)必须严格对应AWID,且只能在从机确认所有 W beat 接收完毕后才发出。若合并,W 通道既要承载数据又要承载完成信号,会导致:

  • 从机无法在 W 数据未收全时发送部分响应;
  • 主机无法区分“数据送达”和“事务完成”两个语义;
  • interconnect 无法对 B 通道做独立 QoS 调度(如优先返回 critical write 的响应)。

B 通道是 AXI3 事务原子性的最后防线,砍掉它,就等于放弃协议级的可靠性保障。

6.2 为什么 ID 位宽宁大勿小?——扩展性比面积更重要

AXI3 规范允许 ID 宽度为 1~16 bit,许多团队为省面积选 4-bit。但实践中,4-bit ID 在以下场景迅速耗尽:

  • 多核 CPU:每个 core 分配 2-bit,仅剩 2-bit 给 DMA/PCIe;
  • 多级 interconnect:每级需 1-bit 扩展,两级即占 2-bit;
  • 虚拟化支持:Hypervisor 需额外 2-bit 标识 VM ID。

我们最终采用 8-bit ID,其中高 2-bit 为 master ID,中 4-bit 为事务 ID,低 2-bit 保留。虽然增加 8 根信号线,但避免了后期因 ID 耗尽而重构整个 interconnect 的噩梦。硅片面积是沉没成本,而重流片是时间与金钱的双重死刑。

6.3 我每次写 interconnect 都强制做的三件事

  1. 第一件事:为每个 ID 维护独立的 request/response queue,并用 formal 证明 queue depth ≥ max outstanding
    Outstanding 数不是拍脑袋定的。它必须满足:queue_depth >= (max_latency_from_master_to_interconnect) + (max_latency_from_interconnect_to_slave)。我们用 JasperGold 对所有 ID queue 做 overflow proof,确保在 worst-case delay 下不丢事务。

  2. 第二件事:在 AW/W/R/B 四个通道的每一级 register slice 后,插入 cycle-accurate 的 VALID/READY handshake monitor
    这个 monitor 不参与功能,只记录AWVALID到AWREADY的 cycle count 分布。上线后发现某条路径平均延迟 7 cycles,但 P99 达到 23 cycles,定位出是某从机仲裁逻辑未加 pipeline。没有这个 monitor,问题会隐藏在系统级性能抖动中,永远无法 root cause。

  3. 第三件事:对所有AWBURST=2'b10(WRAP)的访问,强制插入 address alignment checker,并在 misalign 时触发 unique error code
    WRAP 的对齐要求是硬件级硬约束,但软件 driver 常因计算错误触发 misalign。与其让系统静默失败,不如用 checker 生成DECERR并 logAWADDR/AWSIZE/AWLEN,让 firmware 能精准修复 driver bug。

从那以后我每次写 interconnect,都先花三天搭好这三件事的框架,再开始功能开发。它不会让代码变短,但会让 tape-out 前的 debug 时间从 3 个月压缩到 2 周。希望帮到你。

本文还有配套的精品资源,点击获取

返回列表