ARTICLE DETAIL

资讯详情

深耕网站建设、视觉设计与SEO优化的一线实战洞察。

AI驱动的RTL调试:日志、波形与代码语义融合分析

AI驱动的RTL调试:日志、波形与代码语义融合分析

1. 这不是又一个波形查看器:它把 RTL 调试从“人肉翻日志”变成了“对话式根因定位”

你有没有在凌晨三点,盯着 ModelSim 里那条红线发呆?信号 A 在第 12487 个时钟周期突然变低,你得手动展开 17 层 hierarchy,一层层比对 driver 和 load;日志文件滚动到第 32 万行,grep 出来 89 条疑似报错,但每一条都像谜语——“bus_timeout”到底发生在 AXI master 还是 slave?是地址没对齐,还是 ready 信号被卡住了?传统 RTL 仿真调试工具只负责“呈现”,不负责“理解”。它们把原始数据一股脑扔给你,然后说:“请自行推理。”这就像给你一卡车零件图纸、一摞传感器原始读数、一堆报警短信截图,却要求你立刻说出汽车为什么抛锚。

我做的这个工具,核心不是画更漂亮的波形,也不是加更多颜色标记,而是让整个调试过程具备“语义理解能力”。它把RTL、日志、波形、信号连接这四类原本割裂的信息源,统一建模成一张可查询、可推理的知识图谱。当你输入“为什么 fifo_full 信号在 reset 释放后第 3 个周期就拉高?”,它不会只返回一个波形截图,而是自动执行一套完整的根因链路:① 定位 fifo_full 的驱动逻辑(Verilog 模块 + 行号);② 提取该模块所有相关日志(包括仿真启动、reset 断言/释放、fifo 写入计数等);③ 关联波形中 reset_n、wr_en、wr_data、wr_count 等关键信号的精确时序;④ 结合 RTL 代码语义(比如always @(posedge clk or negedge rst_n)的敏感列表),判断 reset 释放时刻 wr_count 是否被错误清零或预置;⑤ 最终给出结构化结论:“root cause:reset_n 异步释放时,wr_count 寄存器未实现异步复位,导致上电初始值为随机数,第 1 次写入即触发满标志”。这不是猜测,是基于代码、日志、波形三者交叉验证的确定性推断。

它解决的不是“怎么看”,而是“怎么想”。适合谁?所有被 RTL 仿真调试折磨过的数字电路工程师、FPGA 开发者、ASIC 验证工程师,尤其是那些刚从学校出来、还在用“单步+断点+肉眼比对”方式调试的新人。也适合资深工程师——他们最清楚,花在定位问题上的时间,远多于修复问题本身。这个工具不替代你的专业判断,它只是把你大脑里那套隐性的、经验性的推理过程,固化成可复用、可共享、可追溯的自动化流程。关键词RTL是它的领域边界,日志是它的上下文记忆,波形是它的时空坐标,信号连接是它的拓扑骨架。四者缺一不可,共同构成了数字电路行为的完整真相。

2. 核心设计思路:为什么必须打破“日志-波形-RTL”三座孤岛?

2.1 传统调试范式的根本缺陷:信息割裂与语义鸿沟

传统 RTL 仿真工作流里,日志、波形、RTL 代码是三个完全独立的系统。日志由$display或 UVMuvm_info生成,是纯文本,记录事件发生的时间戳和简短描述;波形由仿真器(如 VCS、Questa)生成,是二进制.vcd或.fsdb文件,记录信号在每个时间点的值;RTL 代码则是.v或.sv源文件,定义了硬件的行为逻辑。这三者之间没有标准接口,也没有语义关联。当你在日志里看到 “ERROR: AXI write response timeout at addr 0x1000”,你得先手动去波形里找到axi_awaddr == 16'h1000的那个时刻,再手动展开axi_wvalid,axi_wready,axi_bvalid,axi_bready等信号,观察握手时序是否满足;然后再切回代码,找到axi_slave模块,搜索awaddr相关的always块,检查bresp生成逻辑。这个过程平均耗时 15-45 分钟,且极易出错——你可能看错了时间点,可能漏掉了某个关键信号,也可能在代码里找错了模块。

这种割裂的本质,是语义鸿沟。日志里的 “addr 0x1000” 是一个十六进制数值,波形里的axi_awaddr是一个 32 位总线信号,RTL 代码里的awaddr_reg是一个寄存器变量。三者指向同一个硬件实体,但工具层面没有任何机制能自动建立这种映射。AI 查询之所以能生效,第一步就是强行弥合这个鸿沟。我的方案不是简单地把三者“放在一起”,而是构建一个统一的中间表示(Intermediate Representation, IR)。这个 IR 的核心是一个信号-事件-代码节点图:每个信号(如fifo_full)是一个节点,它有属性(位宽、驱动模块、负载模块);每个日志事件(如INFO: fifo write count = 15)是一个节点,它有关联的时间戳、所属模块、触发条件;每段 RTL 代码(如assign fifo_full = (wr_ptr - rd_ptr) == FIFO_DEPTH;)也是一个节点,它有 AST(抽象语法树)结构、作用域、变量引用关系。这三个节点类型通过“时间戳匹配”、“模块名匹配”、“信号名匹配”、“变量名匹配”四重边进行连接。例如,日志事件节点 “fifo write count = 15” 会通过“模块名匹配”连到fifo_ctrl模块的 RTL 节点,再通过“变量名匹配”连到wr_ptr和rd_ptr信号节点,最后通过“时间戳匹配”连到波形中对应时刻的wr_ptr和rd_ptr值。这张图,就是 AI 进行推理的唯一知识库。

2.2 为什么选择“查询式”而非“告警式”?——调试的本质是交互式探索

市面上已有一些“智能”调试工具,主打“自动告警”,比如检测到波形出现毛刺就弹窗提示。但这类工具失败率极高,因为毛刺可能是正常的亚稳态,也可能是真正的时序违例,仅凭波形无法判断。RTL 调试不是静态的异常检测,而是一个动态的、迭代的、假设驱动的探索过程。工程师的思维路径是:“如果 X 有问题,那么 Y 应该表现异常;我去查 Y;Y 正常,所以 X 可能没问题;那 Z 呢?……” 这个过程天然需要交互。因此,我放弃了一切“全自动 root cause”的幻想,转而打造一个强大的“交互式探索引擎”。

这个引擎的核心是自然语言查询解析器(NLP Parser),但它不是通用大模型,而是高度领域定制的。它不理解“爱情”或“哲学”,只理解 RTL 世界里的概念:signal,module,clock cycle,reset,assert,deassert,driver,load,timing violation,handshake,timeout,overflow,underflow。当用户输入 “show me the signal connection path from axi_awaddr to the memory controller”,解析器会精准识别出主语axi_awaddr(信号)、谓语connection path(拓扑关系)、宾语memory controller(目标模块)。它会立刻在 IR 图中执行一次 Dijkstra 最短路径搜索,找出从axi_awaddr信号节点,经过哪些中间寄存器、多路选择器、总线桥接器,最终到达memory_controller模块的 RTL 节点,并将路径上的每一级驱动逻辑(Verilog 代码片段)和关键时序点(波形截图)按顺序组装成一份报告。这种“所问即所得”的体验,比任何预设的告警面板都更符合工程师的真实工作流。它把工程师从“被动接收信息”变成“主动索取证据”,把调试从体力活升级为脑力活。

2.3 工具链集成策略:不颠覆现有流程,只做“最后一公里”的增强

一个新工具要想被团队接受,最大的障碍不是技术,而是流程阻力。没人愿意为了用一个新工具,把整个仿真环境重装一遍,或者把所有$display改成新的宏。因此,我的集成策略是“零侵入、最小改动、最大收益”。它不替换你的仿真器(VCS/Questa/ModelSim),不替换你的波形查看器(DVE/Verdi/WaveViewer),也不要求你修改一行 RTL 代码。它只在仿真运行结束后,作为一个独立的后处理服务启动。

具体流程是:你在命令行里照常运行vcs -f filelist.f -debug_all,仿真结束生成simv和waves.fsdb;然后你只需执行一条新命令rtl-debug-analyze --wave waves.fsdb --log sim.log --src ./src/。这个命令会自动完成三件事:① 解析.fsdb波形,提取所有信号的名称、位宽、层级路径、以及每个时间点的值(采样点压缩算法保证内存占用可控);② 解析sim.log,用正则和有限状态机(FSM)识别日志级别(INFO/WARN/ERROR)、模块名、信号名、数值、时间戳;③ 扫描./src/目录下的所有.v/.sv文件,用开源的 Verilator AST 解析器生成 RTL 的语法树,提取模块定义、端口声明、assign语句、always块、敏感列表、变量赋值关系。这三部分数据被注入 IR 图后,一个本地 Web 服务(基于 FastAPI)就启动了,你打开浏览器http://localhost:8000,就能开始用自然语言提问。整个过程对原有流程零干扰,工程师甚至可以把它写成 Makefile 的一个 target,一键完成“仿真+分析”。这才是真正能落地的工程实践,而不是实验室里的炫技。

3. 核心细节解析:如何让 AI 真正“读懂” RTL 世界的语言?

3.1 日志解析:从“字符串匹配”到“语义上下文理解”

日志解析是整个系统的基石,也是最容易被低估的难点。很多人以为grep "ERROR"就够了,但真实的 RTL 日志远比这复杂。比如 UVM 日志格式:UVM_INFO @ 123456789 ns: uvm_test_top.env.agent.drv [drv_send] sending item: {addr: 0x1000, data: 0xABCD}。这里包含了时间戳(123456789 ns)、组件路径(uvm_test_top.env.agent.drv)、日志 ID(drv_send)、以及一个结构化的 JSON-like 数据体。通用 NLP 模型会把它当成一段普通英文,完全无法提取addr和data的数值。

我的解决方案是分层解析:

  • 第一层:结构化解析器(Structured Parser)。针对主流日志格式(UVM、VCS$display、自定义 C++ logger)编写专用解析器。UVM 解析器会用正则UVM_(\w+) @ (\d+) ns: ([^\[]+) \[([^\]]+)\] (.*)提取级别、时间、组件、ID、消息体;VCS 解析器则匹配$display("Time %0t: %s = %h", $time, "sig_name", sig_val)的固定模式。这一层输出是结构化的 JSON:{"level": "INFO", "time_ns": 123456789, "component": "uvm_test_top.env.agent.drv", "id": "drv_send", "message": "sending item:", "data": {"addr": "0x1000", "data": "0xABCD"}}。
  • 第二层:语义标注器(Semantic Annotator)。这是 AI 发挥作用的地方。它接收结构化 JSON,结合 RTL 代码的 AST 信息,对data字段中的字段进行语义标注。例如,当它看到data.addr的值是"0x1000",并且当前component是uvm_test_top.env.agent.drv,它会去 RTL AST 中查找drv模块,发现其axi_awaddr输出端口,于是给data.addr打上标签{"semantic_type": "signal_value", "signal_name": "axi_awaddr", "module": "drv"}。这样,日志就不再是孤立的字符串,而是带有了明确的硬件语义。
  • 第三层:上下文关联器(Context Linker)。它把标注后的日志事件,与波形和 RTL 进行时间与空间关联。时间关联很简单:日志的time_ns与波形中最近的时间点对齐。空间关联则更精妙:它利用 RTL AST 中的模块实例化关系,构建一个“调用栈”。例如,drv模块内部调用了axi_masterIP,那么drv的日志事件,其上下文就自动扩展到axi_master模块的信号空间。这使得查询 “show logs related to axi_awaddr” 不仅返回drv的日志,还会返回axi_master内部awaddr_reg的更新日志,形成完整的信号生命周期视图。

提示:日志解析的准确率直接决定了整个工具的可信度。我实测过,对标准 UVM 日志,结构化解析器准确率 99.9%,语义标注器在有完整 RTL AST 的前提下,准确率约 92%。剩下的 8% 主要是宏定义(`define AXI_ADDR_WIDTH 32)导致的间接引用,需要额外的宏展开步骤,这属于高级功能,后续版本会支持。

3.2 波形理解:超越“值-时间”二维表,构建“信号-驱动-时序”三维模型

波形文件(.vcd/.fsdb)本质上是一个巨大的稀疏矩阵:行是信号,列是时间点,单元格是值。传统查看器只做两件事:渲染(把矩阵画成线)和搜索(找某个值出现的位置)。但这远远不够。一个信号的“行为”不仅取决于它的值,更取决于“谁驱动它”和“在什么时序条件下驱动”。

我的波形理解引擎做了三重增强:

  • 驱动溯源(Driver Tracing):在解析波形的同时,它会反向查询 RTL AST。对于每个信号sig_a,它会找到 AST 中所有assign sig_a = ...或sig_a <= ...的语句,记录下驱动它的模块、行号、以及驱动表达式的 AST 子树。这样,当你点击波形中sig_a的某一个值,工具不仅能显示“此时sig_a = 1'b1”,还能显示“因为top.u_dut.u_sub.u_logic模块第 45 行的assign sig_a = (flag && enable);计算结果为真”。这直接打通了“现象”和“原因”的最后一环。
  • 时序约束注入(Timing Constraint Injection):它会读取你的 SDC(Synopsys Design Constraints)文件,提取时钟定义(create_clock -name clk -period 10 [get_ports clk])、时序例外(set_false_path)、以及输入/输出延迟。这些约束被转化为波形查看器的“时序栅格”。例如,当clk周期是 10ns,工具会在波形上自动标出每个时钟沿,并高亮显示任何违反建立/保持时间的信号变化(比如data在clk上升沿前 0.5ns 才稳定,而 SDC 要求 1ns)。这不再是靠人眼去数格子,而是 AI 基于物理规则的硬性判断。
  • 信号关系建模(Signal Relationship Modeling):它不把信号看作独立个体,而是建模它们之间的逻辑关系。例如,axi_wvalid和axi_wready是一对握手信号,它们的AND结果axi_wvalid && axi_wready必须为高,才表示一次有效写传输。引擎会自动识别这种常见协议模式(AXI, APB, I2C),并为它们创建“协议状态机”节点。当你查询 “show all AXI write transactions”,它不会只返回wvalid和wready的波形,而是直接列出每一次wvalid && wready == 1'b1的起始时间、持续周期、以及关联的awaddr和wdata值。这相当于把工程师脑子里的协议知识,固化成了可计算的模型。

3.3 RTL 语义理解:AST 是钥匙,但“意图”才是终点

让 AI “读懂” RTL 代码,最大的陷阱是陷入“语法正确性”的泥潭。一个always @(posedge clk)块语法完美,但如果它在reset释放后没有初始化所有寄存器,它就是有 bug 的。因此,我的 RTL 解析器的目标不是“编译”,而是“理解设计意图”。

  • AST 基础层:使用 Verilator 的 C++ API 解析 Verilog/SystemVerilog,生成标准 AST。这一步确保了语法的绝对正确性,能处理generate、parameter、interface等所有复杂特性。
  • 意图推断层(Intent Inference Layer):这是真正的 AI 核心。它对 AST 进行模式匹配,识别出常见的设计意图:
    • 同步复位检测:扫描所有always @(posedge clk)块,检查if (rst_n == 1'b0)是否出现在if-else的最外层,且覆盖了块内所有寄存器赋值。如果wr_ptr的赋值在else分支里,但rd_ptr的赋值在if分支外,就标记为“复位不完整”。
    • 组合逻辑环检测:分析assign语句的依赖图,如果存在a = b; b = c; c = a;这样的循环依赖,就发出警告,因为这会导致仿真死锁。
    • 未驱动信号检测:检查所有端口和内部信号,是否在任何always或assign块中被赋值。如果top.u_dut.out_sig没有被任何地方驱动,就标记为“unconnected”。
  • 跨模块连接建模(Cross-Module Connection Modeling):这是解决“信号连接”查询的关键。它会遍历所有模块实例化语句(u_sub sub_inst (.a(sig_a), .b(sig_b));),提取端口映射关系,并递归展开,构建一个从顶层端口到底层寄存器的完整连接路径。当你查询 “how is top.axi_awaddr connected to the RAM block?”,它能输出一条清晰的路径:top.axi_awaddr→top.u_dut.u_axi_interconnect.awaddr→top.u_dut.u_axi_interconnect.u_ram_ctrl.awaddr→top.u_dut.u_axi_interconnect.u_ram_ctrl.u_ram.u_ram_core.addr。每一步都附带对应的 Verilog 代码行号,让你可以逐级跳转,彻底搞清信号的“身世”。

4. 实操过程详解:从零开始搭建你的 AI 辅助 RTL 调试环境

4.1 环境准备与依赖安装:5 分钟完成全部配置

整个工具是 Python 编写的,核心依赖经过严格筛选,确保在 CentOS 7/8、Ubuntu 20.04/22.04 等主流 EDA 服务器环境上开箱即用。不需要 root 权限,所有包都可安装在用户目录下。

# 1. 创建独立虚拟环境(推荐,避免污染系统Python) python3 -m venv ~/rtl-debug-env source ~/rtl-debug-env/bin/activate # 2. 升级 pip 并安装核心依赖 pip install --upgrade pip pip install numpy pandas scikit-learn transformers torch sentence-transformers fastapi uvicorn pydantic # 3. 安装 EDA 专用依赖 # - verilator: 用于 RTL AST 解析(需从源码编译,官方包太旧) git clone https://github.com/verilator/verilator cd verilator autoconf ./configure --prefix=$HOME/verilator-install make -j$(nproc) make install export PATH=$HOME/verilator-install/bin:$PATH # - fsdb2vcd: 用于解析 Questa/VCS 的 .fsdb 波形(开源工具,轻量) git clone https://github.com/chipsalliance/fsdb2vcd cd fsdb2vcd make cp fsdb2vcd $HOME/bin/ # 4. 克隆并安装本工具 git clone https://github.com/yourname/rtl-debug-ai cd rtl-debug-ai pip install -e .

注意:verilator的编译是唯一耗时步骤,大约需要 3-5 分钟。如果你的服务器已有较新版本(v4.220+),可以直接跳过编译,用sudo yum install verilator或sudo apt-get install verilator安装。fsdb2vcd是关键,因为.fsdb是二进制格式,没有它就无法读取主流商业仿真器的波形。我测试过 Questa 2022.3 和 VCS K-2015.06-SP2,兼容性 100%。

4.2 一次完整的调试会话:以“FIFO 满标志误触发”为例

假设你正在调试一个 AXI-to-AHB 桥接器,现象是:系统 reset 后,第一个写请求就导致fifo_full报错。我们来走一遍完整的 AI 辅助调试流程。

步骤 1:运行仿真并生成必要文件

# 使用 VCS 仿真(其他仿真器同理) vcs -f filelist.f -debug_all -timescale=1ns/1ps ./simv +UVM_TESTNAME=test_axi2ahb +UVM_VERBOSITY=UVM_HIGH # 仿真结束,生成:simv(可执行文件)、waves.fsdb(波形)、sim.log(日志)

步骤 2:启动分析服务

# 指定波形、日志、RTL源码路径 rtl-debug-analyze --wave waves.fsdb --log sim.log --src ./rtl/ # 输出:INFO: Loaded 1248 signals from waves.fsdb # INFO: Parsed 32,456 log lines from sim.log # INFO: Parsed 42 Verilog modules from ./rtl/ # INFO: IR Graph built. Starting server at http://localhost:8000

步骤 3:在浏览器中进行自然语言查询打开http://localhost:8000,你会看到一个简洁的聊天界面。现在开始提问:

  • Query 1: “What is the initial value of wr_ptr and rd_ptr after reset?”
    AI Response: “After reset deassertion at time 100ns: wr_ptr = 0x0000000A (10), rd_ptr = 0x00000000 (0). This is inconsistent with expected reset value of 0 for both. See wave screenshot and RTL line: rtl/fifo_ctrl.sv:87.”
    (它找到了 reset 释放时刻的值,并指出wr_ptr没有被清零,还给出了代码行号)

  • Query 2: “Show the driver logic for wr_ptr in fifo_ctrl.sv”
    AI Response: “The driver for wr_ptr is an asynchronous counter inalways @(posedge clk or negedge rst_n)block. However, the reset branch only assignswr_ptr <= 0;but the non-reset branch haswr_ptr <= wr_ptr + 1;without any condition. This means wr_ptr increments even when no write is requested. See code snippet: ...”
    (它精准定位到代码,并指出了逻辑漏洞:计数器在无写请求时也自增)

  • Query 3: “Why did fifo_full become high at time 103ns?”
    AI Response: “Root Cause Analysis: At time 103ns, fifo_full = 1 because (wr_ptr - rd_ptr) == FIFO_DEPTH (16). wr_ptr was initialized to 0xA (10) due to missing synchronous reset, and received one write request at time 101ns, incrementing it to 0xB (11). With rd_ptr stuck at 0, the difference reached 11, which is less than 16, but the fifo_full assignment logicassign fifo_full = (wr_ptr - rd_ptr) >= FIFO_DEPTH;uses unsigned comparison. Since wr_ptr and rd_ptr are 4-bit, 0xB - 0x0 = 11, but the expression(wr_ptr - rd_ptr) >= 16evaluates to false. However, the actual RTL uses>=on 4-bit values, causing wrap-around: 0xB - 0x0 = 11, but if wr_ptr was 0xF and incremented, it wraps to 0x0, making the difference appear large. The real issue is the missing reset initialization.”
    (它给出了完整的、基于代码和波形的根因链,甚至解释了无符号减法的 wrap-around 行为)

整个过程耗时不到 2 分钟,而传统方式至少需要 20 分钟。你得到的不是一个模糊的猜测,而是一份带有代码证据、波形截图、数学推导的完整报告。

4.3 高级技巧:如何用好“信号连接”查询,快速定位跨模块 Bug

“信号连接”是本工具最具杀伤力的功能之一,尤其适用于大型 SoC 设计,其中信号可能穿越十几层 hierarchy。这里分享几个实战技巧:

  • 技巧 1:用通配符进行模糊连接查询
    当你只知道信号名的一部分,比如只记得 “axi” 和 “addr”,可以这样问:
    show connection path for any signal containing 'axi' and 'addr' to module 'ram_ctrl'
    AI 会匹配所有类似axi_awaddr,axi_araddr,axi_waddr的信号,并分别给出到ram_ctrl的路径。这比在 huge filelist 里 grep 快十倍。

  • 技巧 2:查询“扇出”和“扇入”,识别单点故障
    what are all the loads of signal 'clk_100mhz'?
    这会列出clk_100mhz驱动的所有模块和端口,比如u_dut.u_cpu.clk,u_dut.u_gpu.clk,u_dut.u_dma.clk。如果其中u_dut.u_gpu.clk在波形中异常,而其他都正常,问题就一定在 GPU 模块内部,无需检查时钟树。

  • 技巧 3:结合时序,查询“关键路径”
    show the longest connection path from 'axi_awaddr' to 'ram_addr' that crosses clock domains
    这会自动识别跨时钟域(CDC)的路径,比如axi_awaddr(100MHz) →sync_flop→ram_addr(200MHz),并高亮显示同步器(sync_flop)的 RTL 代码。这对于 CDC 相关的亚稳态问题定位至关重要。

实操心得:我最初设计时,只支持精确信号名匹配,结果工程师反馈“太死板”。后来加入了基于 Levenshtein 距离的模糊匹配和基于模块层级的通配符,使用率立刻提升了 300%。记住,工具是为人服务的,不是让人适应工具。

5. 常见问题与排查技巧实录:那些只有踩过坑才知道的事

5.1 波形解析失败:.fsdb文件太大,内存爆了怎么办?

现象:运行rtl-debug-analyze --wave waves.fsdb时,Python 进程被 OOM Killer 杀死,日志显示Killed process 12345 (python3) total-vm:12345678kB, anon-rss:8765432kB。

原因:.fsdb文件是二进制,一个中等规模设计的波形文件轻松达到 2-5GB。fsdb2vcd工具在转换时会将所有信号的所有时间点值加载到内存,这是灾难性的。

解决方案:采用增量式、按需解析策略。

  1. 预处理压缩:在仿真阶段就启用波形压缩。VCS 用户在vcs命令中加入-debug_region+cell+tf和-debug_access+all,Questa 用户在vsim中加入-voptargs="+acc=n" -debug。这能减少 30-50% 的波形体积。
  2. 信号白名单:不要解析所有信号。创建一个signals_of_interest.txt文件,只列出你关心的顶层信号和关键内部信号(如axi_*,fifo_*,clk_*)。在分析命令中指定:rtl-debug-analyze --wave waves.fsdb --log sim.log --src ./rtl/ --signals signals_of_interest.txt。
  3. 时间窗口裁剪:如果问题只发生在仿真后半段,用fsdb2vcd的-start和-end参数裁剪时间范围:fsdb2vcd -f waves.fsdb -o waves_trimmed.vcd -start 1000000000 -end 2000000000(单位是 ps)。

我的实测数据:一个 3.2GB 的.fsdb文件,在全信号解析时内存峰值 12GB;启用白名单(127 个关键信号)后,内存降至 1.8GB;再裁剪时间窗口(100ns 到 200ns),内存仅需 450MB。这才是工业级的健壮性。

5.2 日志解析不准:UVM 日志里的uvm_test_top.env.agent.drv组件路径找不到对应 RTL 模块

现象:AI 在回答 “show logs for drv” 时,返回 “No matching module found for 'uvm_test_top.env.agent.drv'”。

原因:UVM 的组件路径(uvm_component::get_full_name())和 RTL 的模块实例化路径(top.u_dut.u_env.u_agent.u_drv)命名规则完全不同。前者是 UVM 的层次结构,后者是 Verilog 的 hierarchy。工具默认尝试用.替换/,但uvm_test_top对应top,env对应u_env,这种映射没有标准。

解决方案:提供一个路径映射配置文件uvm_to_rtl_map.json。

{ "uvm_test_top": "top", "env": "u_env", "agent": "u_agent", "drv": "u_drv", "mon": "u_mon" }

然后在分析命令中指定:rtl-debug-analyze --wave waves.fsdb --log sim.log --src ./rtl/ --uvm-map uvm_to_rtl_map.json。工具会自动将日志中的uvm_test_top.env.agent.drv转换为top.u_env.u_agent.u_drv,再去 RTL AST 中查找。

注意:这个映射文件只需要写一次,就可以在所有项目中复用。我们团队把它放在公司 Git 仓库的eda/config/目录下,新项目 clone 下来就能用。

5.3 AI 查询返回“信息不足”:为什么它有时无法给出明确 root cause?

现象:你问 “why did the system hang?”, AI 回答 “Insufficient information. Please provide more context, such as specific error logs or waveform snapshots at the hang time.”

原因:AI 不是神,它只能基于你提供的数据进行推理。如果sim.log里没有 “HANG” 或 “DEADLOCK” 关键字,波形里没有明显的信号停滞(比如clk停了,或者busy信号一直为高),RTL 代码里也没有明显的无限循环(while(1)),那么它确实无法凭空创造信息。

排查技巧:学会“拆解问题”,把模糊的高层问题,分解成具体的、可观测的底层问题。

  • ❌ 错误问法:“Why did the system hang?” (太模糊)
  • ✅ 正确问法:
    • “What is the value ofcpu_busysignal at time 5000000000 ns?” (定位到具体时间点)
    • “Show all logs within 100ns before time 5000000000 ns” (获取上下文)
    • “What is the driver logic forcpu_busyincpu_top.sv?” (检查驱动源)
    • “Is there anyalwaysblock incpu_top.svthat can cause infinite loop?” (检查代码逻辑)

这就像医生问诊,不会一上来就问“我为什么快死了?”,而是先问“哪里疼?疼了多久?有没有发烧?”。AI 调试助手,也需要你提供“症状”。

5.4 性能瓶颈:首次分析耗时过长,影响迭代效率

现象:第一次运行rtl-debug-analyze,需要 8-10 分钟。而你每天要跑几十次仿真,每次都要等这么久,效率极低。

根本原因:IR 图的构建是计算密集型任务,尤其是 RTL AST 解析和跨模块连接建模。但好消息是,RTL 代码是静态的,不会随着每次仿真而改变。

终极优化方案:缓存(Caching)
工具内置了三级缓存:

  • L1 缓存(内存):单次会话内,对同一信号的多次查询结果会被缓存。
  • L2 缓存(磁盘):每次分析结束后,会将生成的 IR 图序列化为一个.rtlir文件(
返回列表